Price
type: Property
comment: Offer price of a credential, learning resource, assessment, related activity or resource.
term status: stable
change history: https://credreg.net/ctdl/termhistory/ceterms/price/json
domain includes: CostProfile
range includes: integer
equivalent property: price