Process Method
type: Property
comment: Webpage or online document that describes the process methods.
term status: stable
change history: https://credreg.net/ctdl/termhistory/ceterms/processMethod/json
domain includes: ProcessProfile
range includes: anyURI