Recognized In
type: Property
comment: Region or political jurisdiction such as a state, province or locale in which the credential, learning resource, or assessment has been publicly recommended, acknowledged or endorsed.
term status: stable
change history: https://credreg.net/ctdl/termhistory/ceterms/recognizedIn/json
domain includes: ApprenticeshipCertificate
domain includes: AssessmentProfile
domain includes: AssociateDegree
domain includes: BachelorDegree
domain includes: Badge
domain includes: Certificate
domain includes: Certification
domain includes: Credential
domain includes: CredentialOrganization
domain includes: CredentialPerson
domain includes: Degree
domain includes: DigitalBadge
domain includes: Diploma
domain includes: DoctoralDegree
domain includes: GeneralEducationDevelopment
domain includes: JourneymanCertificate
domain includes: LearningOpportunityProfile
domain includes: License
domain includes: MasterCertificate
domain includes: MasterDegree
domain includes: MicroCredential
domain includes: OpenBadge
domain includes: ProfessionalDoctorate
domain includes: QACredentialOrganization
domain includes: QualityAssuranceCredential
domain includes: ResearchDoctorate
domain includes: SecondarySchoolDiploma
range includes: JurisdictionProfile