Resident Of
type: Property
comment: Geographic or political region of which a person must be a legal resident or citizen in order to be eligible for the credential.
description: Residency defines the duration of stay required by national, state, provincial or local laws that entitles a person to the legal protection and benefits provided to the applicable type.
term status: stable
change history: https://credreg.net/ctdl/termhistory/ceterms/residentOf/json
domain includes: ConditionProfile
range includes: JurisdictionProfile