Revocation Criteria
type: Property
comment: Webpage or online document that provides information about the removal criteria for an awarded credential.
term status: stable
change history: https://credreg.net/ctdl/termhistory/ceterms/revocationCriteria/json
domain includes: RevocationProfile
range includes: anyURI