Rule Set Used
type: Property
comment: Resource defining the applicable method or algorithm used for fulfilling the requirements of the ComponentCondition.
term status: unstable
change history: https://credreg.net/ctdl/termhistory/ceterms/ruleSetUsed/json
domain includes: RuleSetProfile
range includes: anyURI