Source Data
type: Property
comment: Structured data representing the resource.
description: The preferred data serialization is JSON-LD or some other serialization of RDF.
term status: stable
change history: https://credreg.net/ctdl/termhistory/ceterms/sourceData/json
domain includes: AssessmentComponent
domain includes: BasicComponent
domain includes: CocurricularComponent
domain includes: CompetencyComponent
domain includes: CourseComponent
domain includes: CredentialComponent
domain includes: ExtracurricularComponent
domain includes: JobComponent
domain includes: SelectionComponent
domain includes: WorkExperienceComponent
range includes: anyURI