Spatial Coverage
type: Property
comment: Spatial coverage of an entity indicates the place(s) to which its content applies or in which it occurres.
description: In the CTDL, the ceterms:spatialCoverage property serves as a super-property for an array of sub-properties defining location-dependent or area-dependent aspects of a resource.
term status: stable
change history: https://credreg.net/ctdl/termhistory/ceterms/spatialCoverage/json
range includes: GeoCoordinates
range includes: JurisdictionProfile
range includes: Place
range includes: PostalAddress
equivalent property: spatialCoverage