Street Address
type: Property
comment: Street address. e.g. "1600 Amphitheatre Pkwy".
term status: stable
change history: https://credreg.net/ctdl/termhistory/ceterms/streetAddress/json
domain includes: Place
domain includes: PostalAddress
range includes: langString
equivalent property: streetAddress