Submission Of
type: Property
comment: Artifact to be submitted such as a transcript, portfolio, or an affidavit.
term status: stable
change history: https://credreg.net/ctdl/termhistory/ceterms/submissionOf/json
domain includes: ConditionProfile
range includes: anyURI