Target Learning Opportunity
type: Property
comment: Learning opportunity that is the focus of a condition, process or another learning opportunity.
term status: stable
change history: https://credreg.net/ctdl/termhistory/ceterms/targetLearningOpportunity/json
domain includes: ConditionProfile
domain includes: LearningOpportunityProfile
domain includes: ProcessProfile
range includes: LearningOpportunity
range includes: LearningOpportunityProfile