Target Learning Resource
type: Property
comment: Learning object or resource that is used as part of a learning activity.
description: Examples include a textbook or lesson plan that describes or records the educational activity (e.g. an audio- or video-recording of a lesson).
term status: stable
change history: https://credreg.net/ctdl/termhistory/ceterms/targetLearningResource/json
domain includes: AssessmentProfile
domain includes: LearningOpportunityProfile
range includes: LearningResource