Career Pathway
type: Property
comment: Career pathway in which the credential is a potential component.
term status: unstable
change history: https://credreg.net/ctdl/termhistory/ceterms/targetPathway/json
domain includes: ConditionProfile
range includes: CareerPathway