Task Profiled
type: Property
comment: The cost profile being described is a profile of the task being referenced.
term status: deprecated
change history: https://credreg.net/ctdl/termhistory/ceterms/taskProfiled/json
range includes: TaskProfile