Years of Experience
type: Property
comment: Years of relevant experience.
usage note: Non-integer year values may be expressed as point value, for example, 0.25, 1.5, etc.
term status: stable
change history: https://credreg.net/ctdl/termhistory/ceterms/yearsOfExperience/json
domain includes: ConditionProfile
range includes: float