Failed Action Status
type: Concept
definition: Action that failed to complete.
description: The action's error property and the HTTP return code contain more information about the failure.
term status: stable
change history: https://credreg.net/ctdl/termhistory/actionStat/FailedActionStatus/json
in scheme: ActionStatus
top concept of: ActionStatus