Beginner Level
type: Concept
definition: Intended for novices or those with limited experience.
term status: stable
change history: https://credreg.net/ctdl/termhistory/audLevel/BeginnerLevel/json
in scheme: AudienceLevel
top concept of: AudienceLevel