Intermediate Level
type: Concept
definition: Intended for those with some experience, where knowledge, skills, and competency expectations are staged for development beyond novice-level and in preparation for a more advanced-level.
description: An individual at this level has foundational competencies to function independently with occasional supervision.
term status: stable
change history: https://credreg.net/ctdl/termhistory/audLevel/IntermediateLevel/json
in scheme: AudienceLevel
top concept of: AudienceLevel