Lower Division Level
type: Concept
definition: Intended for those in the first half of an undergraduate level program.
term status: stable
change history: https://credreg.net/ctdl/termhistory/audLevel/LowerDivisionLevel/json
in scheme: AudienceLevel
top concept of: AudienceLevel