Post-Secondary Level
type: Concept
definition: Intended for those who have completed secondary level school programs or equivalent.
term status: stable
change history: https://credreg.net/ctdl/termhistory/audLevel/PostSecondaryLevel/json
in scheme: AudienceLevel
top concept of: AudienceLevel
narrower: AssociatesDegreeLevel
narrower: BachelorsDegreeLevel
narrower: DoctoralDegreeLevel
narrower: MastersDegreeLevel