Professional Level
type: Concept
definition: Intended for those attending professional programs or equivalent, such as law or medicine.
description: Other levels can typically be paired with Professional Level to refine a description of a level.
term status: stable
change history: https://credreg.net/ctdl/termhistory/audLevel/ProfessionalLevel/json
in scheme: AudienceLevel
top concept of: AudienceLevel