Non-Resident
type: Concept
definition: Person whose primary residence is not in nation, state, province, or commonwealth of concern.
term status: stable
change history: https://credreg.net/ctdl/termhistory/audience/NonResident/json
in scheme: Audience
top concept of: Audience