Processing Fee
type: Concept
definition: Cost for processing or expediting information related to the resource being described.
term status: stable
change history: https://credreg.net/ctdl/termhistory/costType/ProcessingFee/json
in scheme: CostType
top concept of: CostType