Program Specific Fee
type: Concept
definition: Additional cost for participation with a specific program or course of study such as engineering, business, and nursing.
term status: stable
change history: https://credreg.net/ctdl/termhistory/costType/ProgramSpecificFee/json
in scheme: CostType
top concept of: CostType