Technology Fee
type: Concept
definition: Cost for accessing technologies related to the learning opportunity or activity.
term status: stable
change history: https://credreg.net/ctdl/termhistory/costType/TechnologyFee/json
in scheme: CostType
top concept of: CostType