Competency Credit
type: Concept
definition: Credit that is issued or accepted for a particular competency or set of competencies.
term status: stable
change history: https://credreg.net/ctdl/termhistory/creditUnit/CompetencyCredit/json
broader: TypeBasedCredit
in scheme: CreditUnit