Institutional Grant
type: Concept
definition: Financial subsidy, including free or discounted tuition or other fees, which doesn’t require repayment, based on meeting requirements determined by an educational institution.
term status: stable
change history: https://credreg.net/ctdl/termhistory/financialAid/InstitutionalGrant/json
broader: Grant
equivalent class: InstitutionalGrants
in scheme: FinancialAssistance