Military
type: Concept
definition: Financial aid available to active duty service members, veterans, and/or their qualified family members.
term status: stable
change history: https://credreg.net/ctdl/termhistory/financialAid/Military/json
equivalent class: https://ceds.ed.gov/element/001610
in scheme: FinancialAssistance
top concept of: FinancialAssistance
narrower: DoDTuitionAssistance
narrower: Post911GIBill
narrower: StateLocalMilitaryAssistance
narrower: VEAP
narrower: VocationalRehabilitation