State or Local Work
type: Concept
definition: Program funded by a state, province, region, and/or local government designed to provide work for students to offset educational expenses.
term status: stable
change history: https://credreg.net/ctdl/termhistory/financialAid/StateLocalWork/json
broader: WorkBased
equivalent class: StateWork
in scheme: FinancialAssistance