Workforce Innovation and Opportunity Act (WIOA)
type: Concept
definition: Financial aid established on behalf of a qualified participant with a training provider that is on the state's Eligible Training Provider List (ETPL).
term status: stable
change history: https://credreg.net/ctdl/termhistory/financialAid/WIOA/json
broader: Grant
in scheme: FinancialAssistance