Educators
type: Concept
definition: External stakeholder review, guidance or recommendations by education instructors or faculty.
term status: stable
change history: https://credreg.net/ctdl/termhistory/inputType/Educators/json
in scheme: ExternalInput
top concept of: ExternalInput