Public
type: Concept
definition: External stakeholder review, guidance or recommendations by community members and the general public.
term status: stable
change history: https://credreg.net/ctdl/termhistory/inputType/Public/json
in scheme: ExternalInput
top concept of: ExternalInput