Assessment Body
type: Concept
definition: Primarily offers assessments for credentials as a service.
term status: stable
change history: https://credreg.net/ctdl/termhistory/orgType/AssessmentBody/json
in scheme: OrganizationType
top concept of: OrganizationType