Magnet/Competitive Admissions School
type: Concept
definition: Public school offering special instruction and programs not available elsewhere, designed to attract a more diverse student body from throughout a school district.
term status: stable
change history: https://credreg.net/ctdl/termhistory/orgType/Magnet/json
broader: SecondarySchool
in scheme: OrganizationType