Career and Technical School
type: Concept
definition: Secondary school that focuses primarily on providing formal preparation for skilled, technical or professional occupations or careers.
term status: stable
change history: https://credreg.net/ctdl/termhistory/orgType/Technical/json
broader: Secondary
in scheme: OrganizationType