Two-Year College
type: Concept
definition: Authorized postsecondary institution that primarily offers associate degrees and certificates, and, if authorized, may also award higher degrees.
description: Includes occupational and vocational schools with programs of at least 1800 hours, academic institutions with programs of less than 4 years, etc.
term status: stable
change history: https://credreg.net/ctdl/termhistory/orgType/TwoYear/json
broader: Postsecondary
in scheme: OrganizationType