Progression Level
type: Class
comment: Identifiable point along a developmental progression of competence, achievement or temporal position.
term status: stable
change history: https://credreg.net/ctdlasn/termhistory/asn/ProgressionLevel/json
subclass of: Concept
domain for: In Progression Model
domain for: CTID
domain for: Broader
domain for: Definition
domain for: Narrower
domain for: Notation
domain for: Note
domain for: Preferred Label
domain for: Top Concept Of

Progression Model
type: Class
comment: Model of identifiable points along a developmental progression including increasing levels of competence, achievement or temporal position (e.g., "Second Quarter").
term status: stable
change history: https://credreg.net/ctdlasn/termhistory/asn/ProgressionModel/json
subclass of: Concept Scheme
domain for: Approximate Date Created
domain for: Approximate Date Modified
domain for: Concept Keyword
domain for: Concept Term
domain for: Creator
domain for: Date Copyrighted
domain for: Date Created
domain for: Date Modified
domain for: Description
domain for: In Language
domain for: License
domain for: Name
domain for: Publication Status Type
domain for: Publisher
domain for: Publisher Name
domain for: Rights
domain for: Rights Holder
domain for: Source
domain for: CTID
domain for: Has Top Concept

Competency
type: Class
comment: Measurable or observable knowledge, skill, or ability necessary to successful performance of a person.
description: Competency is broadly defined to include assertions of academic, professional, occupational, vocational and life goals, outcomes, and standards, however labeled.
term status: stable
change history: https://credreg.net/ctdlasn/termhistory/ceasn/Competency/json
equivalent class: Statement
domain for: Has Progression Level
domain for: Ability Embodied
domain for: Align From
domain for: Align To
domain for: Alternative Coded Notation
domain for: Approximate Date Created
domain for: Approximate Date Modified
domain for: Author
domain for: Broad Alignment
domain for: Coded Notation
domain for: Comment
domain for: Competency Category
domain for: Competency Label
domain for: Competency Text
domain for: Complexity Level
domain for: Comprised Of
domain for: Concept Keyword
domain for: Concept Term
domain for: Creator
domain for: Cross-Subject Reference
domain for: Date Created
domain for: Date Modified
domain for: Derived From
domain for: Education Level Type
domain for: Exact Alignment
domain for: Has Child
domain for: Has Criterion Level
domain for: Has Rubric Criterion
domain for: Identifier
domain for: Inferred Competency
domain for: In Language
domain for: Is Child Of
domain for: Is Part Of
domain for: Is Top Child Of
domain for: Is Version Of
domain for: Knowledge Embodied
domain for: License
domain for: List ID
domain for: Local Subject
domain for: Major Alignment
domain for: Minor Alignment
domain for: Narrow Alignment
domain for: Prerequisite Alignment
domain for: Publication Status Type
domain for: Should Index
domain for: Skill Embodied
domain for: Source Documentation
domain for: Substantiating Competency Framework
domain for: Substantiating Credential
domain for: Substantiating Job
domain for: Substantiating Occupation
domain for: Substantiating Organization
domain for: Substantiating Resource
domain for: Substantiating Task
domain for: Substantiating Work Role
domain for: Task Embodied
domain for: Weight
domain for: CTID
domain for: Industry Type
domain for: Instructional Program Type
domain for: Occupation Type

Competency Framework
type: Class
comment: Entity comprised of a logically related set of competencies.
description: A competency framework serves a container object for a set of competencies.
term status: stable
change history: https://credreg.net/ctdlasn/termhistory/ceasn/CompetencyFramework/json
subclass of: Collection
equivalent class: StandardDocument
domain for: Has Progression Model
domain for: Align From
domain for: Align To
domain for: Approximate Date Created
domain for: Approximate Date Modified
domain for: Author
domain for: Coded Notation
domain for: Concept Keyword
domain for: Concept Term
domain for: Creator
domain for: Date Copyrighted
domain for: Date Created
domain for: Date Modified
domain for: Date Valid From
domain for: Date Valid Until
domain for: Derived From
domain for: Description
domain for: Education Level Type
domain for: Has Top Child
domain for: Identifier
domain for: In Language
domain for: License
domain for: Local Subject
domain for: Name
domain for: Publication Status Type
domain for: Publisher
domain for: Publisher Name
domain for: Repository Date
domain for: Rights
domain for: Rights Holder
domain for: Source
domain for: Source Documentation
domain for: Table of Contents
domain for: CTID
domain for: Industry Type
domain for: Instructional Program Type
domain for: Occupation Type

Criterion Level
type: Class
comment: An individual component or specific element within a criterion that defines a particular aspect or standard for evaluation.
term status: unstable
change history: https://credreg.net/ctdlasn/termhistory/ceasn/CriterionLevel/json
domain for: Has Progression Level
domain for: Benchmark Label
domain for: Benchmark Text
domain for: Coded Notation
domain for: Feedback
domain for: Has Criterion Level
domain for: List ID

Proficiency Scale
type: Class
comment: The class of structured profiles describing discrete levels of expertise and performance mastery.
description: Proficiency scales define levels of performance (what a person does) as distinct from knowledge of specific information (what a person knows) and outline tasks a person can manage and the skills necessary to progressively accomplish explicit competencies at increasing levels of complexity. Proficiency scales: (1) assist in making judgments about the kinds of tasks related to a competency that a person is able to perform; and (2) to compare the abilities of different persons with regard to achievement of those competencies at different levels.
term status: stable
change history: https://credreg.net/ctdlasn/termhistory/ceasn/ProficiencyScale/json
subclass of: EducationalFramework
equivalent class: ProficiencyScale

Rubric
type: Class
comment: A structured and systematic evaluation tool used to assess performance, quality, and/or criteria.
term status: unstable
change history: https://credreg.net/ctdlasn/termhistory/ceasn/Rubric/json
equivalent class: Rubric
domain for: Has Progression Level
domain for: Has Progression Model
domain for: Alternative Coded Notation
domain for: Approximate Date Created
domain for: Approximate Date Modified
domain for: Coded Notation
domain for: Concept Keyword
domain for: Creator
domain for: Date Copyrighted
domain for: Date Created
domain for: Date Modified
domain for: Date Valid From
domain for: Date Valid Until
domain for: Derived From
domain for: Description
domain for: Education Level Type
domain for: Evaluator Type
domain for: Has Criterion Category Set
domain for: Has Rubric Criterion
domain for: Has Rubric Level
domain for: Has Scope
domain for: In Language
domain for: License
domain for: Name
domain for: Publication Status Type
domain for: Publisher
domain for: Publisher Name
domain for: Rights
domain for: CTID
domain for: Industry Type
domain for: Instructional Program Type
domain for: Occupation Type

Rubric Criterion
type: Class
comment: Resource providing explicit criteria for ensuring specific and measurable evaluation.
term status: unstable
change history: https://credreg.net/ctdlasn/termhistory/ceasn/RubricCriterion/json
equivalent class: RubricCriterion
domain for: Has Progression Level
domain for: Coded Notation
domain for: Description
domain for: Has Criterion Category
domain for: Has Criterion Level
domain for: List ID
domain for: Name
domain for: Weight
domain for: CTID

Rubric Level
type: Class
comment: Level or quality indicator used with Rubric Criteria.
term status: unstable
change history: https://credreg.net/ctdlasn/termhistory/ceasn/RubricLevel/json
domain for: Has Progression Level
domain for: Coded Notation
domain for: Description
domain for: Has Criterion Level
domain for: List ID
domain for: Name

Concept
type: Class
comment: Term in a controlled vocabulary.
term status: stable
change history: https://credreg.net/ctdlasn/termhistory/skos/Concept/json
domain for: Source Documentation
domain for: CTID
domain for: Alternative Label
domain for: Broader
domain for: Broad Match
domain for: Change Note
domain for: Close Match
domain for: Definition
domain for: Exact Match
domain for: Hidden Label
domain for: In Scheme
domain for: Narrower
domain for: Narrow Match
domain for: Notation
domain for: Note
domain for: Preferred Label
domain for: Related
domain for: Top Concept Of

Concept Scheme
type: Class
comment: A controlled vocabulary.
term status: stable
change history: https://credreg.net/ctdlasn/termhistory/skos/ConceptScheme/json
domain for: Approximate Date Created
domain for: Approximate Date Modified
domain for: Concept Keyword
domain for: Concept Term
domain for: Creator
domain for: Date Copyrighted
domain for: Date Created
domain for: Date Modified
domain for: Description
domain for: In Language
domain for: License
domain for: Name
domain for: Publication Status Type
domain for: Publisher
domain for: Publisher Name
domain for: Rights
domain for: Rights Holder
domain for: Source
domain for: Source Documentation
domain for: CTID
domain for: Has Top Concept

Has Progression Level
type: Property
comment: Reference to a specific point in a progression model.
term status: stable
change history: https://credreg.net/ctdlasn/termhistory/asn/hasProgressionLevel/json
domain includes: Competency
domain includes: Criterion Level
domain includes: Rubric
domain includes: Rubric Criterion
domain includes: Rubric Level
domain includes: AssessmentComponent
domain includes: BasicComponent
domain includes: CocurricularComponent
domain includes: CollectionComponent
domain includes: CompetencyComponent
domain includes: CourseComponent
domain includes: CredentialComponent
domain includes: ExtracurricularComponent
domain includes: JobComponent
domain includes: MultiComponent
domain includes: WorkExperienceComponent
range includes: Progression Level

Has Progression Model
type: Property
comment: Reference to a progression model used.
term status: stable
change history: https://credreg.net/ctdlasn/termhistory/asn/hasProgressionModel/json
domain includes: Competency Framework
domain includes: Rubric
domain includes: Pathway
domain includes: QualificationsFramework
range includes: Progression Model

Ability Embodied
type: Property
comment: Enduring attributes of the individual that influence performance are embodied either directly or indirectly in this resource.
usage note: The abilityEmbodied property may referenced a defined ability in an ontology such as O*NET or an existing competency defined in a competency framework.
term status: stable
change history: https://credreg.net/ctdlasn/termhistory/ceasn/abilityEmbodied/json
domain includes: Competency
domain includes: Job
domain includes: Occupation
domain includes: Task
domain includes: WorkRole
range includes: Competency

Align From
type: Property
comment: A competency framework or competency from which this competency framework or competency is aligned.
description: An alignment is an assertion of some degree of equivalency between the subject and the object of the assertion.
term status: stable
change history: https://credreg.net/ctdlasn/termhistory/ceasn/alignFrom/json
domain includes: Competency
domain includes: Competency Framework
range includes: Competency
range includes: Competency Framework
equivalent property: alignFrom

Align To
type: Property
comment: A competency framework or competency to which this competency framework or competency is aligned.
description: An alignment is an assertion of some degree of equivalency between the subject and the object of the assertion.
term status: stable
change history: https://credreg.net/ctdlasn/termhistory/ceasn/alignTo/json
domain includes: Competency
domain includes: Competency Framework
range includes: Competency
range includes: Competency Framework
equivalent property: alignTo

Alternative Coded Notation
type: Property
comment: An alphanumeric notation or ID code identifying this competency in common use among end-users.
description: Unlike the codedNotation property, the value for the altCodedNotation property need not be an official identifier created by the promulgating agency. It must be an identifier in common use among end-users of the competency. This property should be seldom used and only with a clear demonstration of need (i.e., in common use). For example, in the Common Core State Standards (Math) in the U.S., the official codedNotation of "CCSS.Math.Content.1.NBT.C.4" is abbreviated in common use by end-users to the unofficial altCodedNotation of "1.NBT.4".
term status: stable
change history: https://credreg.net/ctdlasn/termhistory/ceasn/altCodedNotation/json
sub property of: identifier
domain includes: Competency
domain includes: Rubric
range includes: string
equivalent property: altStatementNotation

Approximate Date Created
type: Property
comment: Approximate date of creation of this resource.
description: The value should be in ISO 8601 date format; specifically YYYY or YYY-MM.
usage note: Values may be just a year (e.g. 2026) or a year and a month (e.g. (2026-05). If the full date, i.e. year, month and day, are known use ceasn:dateCreated.
term status: unstable
change history: https://credreg.net/ctdlasn/termhistory/ceasn/approximateDateCreated/json
domain includes: Progression Model
domain includes: Competency
domain includes: Competency Framework
domain includes: Rubric
domain includes: AlignmentMap
domain includes: PriorLearningPolicy
domain includes: QualificationsFramework
domain includes: TransferAgreement
domain includes: Concept Scheme
range includes: Date

Approximate Date Modified
type: Property
comment: Approximate date on which this resource was most recently modified in some way.
description: The value should be in ISO 8601 date format; specifically YYYY or YYYY-MM.
usage note: Values may be just a year (e.g. 2026) or a year and a month (e.g. (2026-05). If the full date, i.e. year, month and day, are known use ceasn:dateModified.
term status: unstable
change history: https://credreg.net/ctdlasn/termhistory/ceasn/approximateDateModified/json
domain includes: Progression Model
domain includes: Competency
domain includes: Competency Framework
domain includes: Rubric
domain includes: AlignmentMap
domain includes: Occupation
domain includes: PriorLearningPolicy
domain includes: QualificationsFramework
domain includes: Task
domain includes: TransferAgreement
domain includes: Concept Scheme
range includes: Date

Author
type: Property
comment: A person or organization chiefly responsible for the intellectual or artistic content of this competency framework or competency.
term status: stable
change history: https://credreg.net/ctdlasn/termhistory/ceasn/author/json
sub property of: contributor
domain includes: Competency
domain includes: Competency Framework
domain includes: AlignmentMap
domain includes: QualificationsFramework
range includes: string
equivalent property: aut

Benchmark Label
type: Property
comment: Label for the level achieved as defined by the Rubric Criterion.
term status: unstable
change history: https://credreg.net/ctdlasn/termhistory/ceasn/benchmarkLabel/json
domain includes: Criterion Level
range includes: langString

Benchmark Text
type: Property
comment: Description of the level achieved as defined by the Rubric Criterion.
term status: unstable
change history: https://credreg.net/ctdlasn/termhistory/ceasn/benchmarkText/json
domain includes: Criterion Level
range includes: langString

Broad Alignment
type: Property
comment: The referenced competency covers all of the relevant concepts in this competency as well as relevant concepts not found in this competency.
term status: stable
change history: https://credreg.net/ctdlasn/termhistory/ceasn/broadAlignment/json
domain includes: Competency
range includes: Competency
equivalent property: broadAlignment

Coded Notation
type: Property
comment: An alphanumeric notation or ID code as defined by the promulgating body to identify this resource.
description: This property should be used only for codes created by the promulgating body. For alternative competency notations in common use in the community of practice, but not endorsed by the promulgating body, the altCodedNotation property can be used (sparingly on clear evidence of common use and need).
term status: stable
change history: https://credreg.net/ctdlasn/termhistory/ceasn/codedNotation/json
sub property of: identifier
domain includes: Competency
domain includes: Competency Framework
domain includes: Criterion Level
domain includes: Rubric
domain includes: Rubric Criterion
domain includes: Rubric Level
range includes: string
equivalent property: statementNotation
equivalent property: humanCodingScheme
equivalent property: codedNotation

Comment
type: Property
comment: Supplemental text provided by the promulgating body that clarifies the nature, scope or use of this resource.
description: Use this property when the text provides useful context for this resource.
term status: stable
change history: https://credreg.net/ctdlasn/termhistory/ceasn/comment/json
domain includes: Competency
domain includes: Industry
domain includes: Job
domain includes: Occupation
domain includes: Task
domain includes: WorkRole
domain includes: Observation
range includes: langString
equivalent property: comment
equivalent property: notes

Competency Category
type: Property
comment: The textual label identifying the category of the competency as designated by the promulgating body.
description: This property points to a class, not to instances of that class. For example, where two competencies in a competency framework have been identified respectively by the promulgating agency as "Strand: Renaissance" and "Strand: Social history", the statementLabel for both these competencies is "Strand".
term status: stable
change history: https://credreg.net/ctdlasn/termhistory/ceasn/competencyCategory/json
domain includes: Competency
range includes: langString
equivalent property: statementLabel
equivalent property: CFItemType

Competency Label
type: Property
comment: Short identifying phrase or name applied to a competency by the creator of the competency framework.
usage note: Where such a label is the sole expression of the competency, enter the text as competencyText as opposed to competencyLabel.
term status: stable
change history: https://credreg.net/ctdlasn/termhistory/ceasn/competencyLabel/json
sub property of: Name
sub property of: name
domain includes: Competency
range includes: langString

Competency Text
type: Property
comment: The text of the competency.
usage note: This property should be used to provide the actual text of the competency statement. To provide information about the competency other than the text itself, use the comment property.
term status: stable
change history: https://credreg.net/ctdlasn/termhistory/ceasn/competencyText/json
sub property of: description
domain includes: Competency
range includes: langString
equivalent property: fullStatement

Complexity Level
type: Property
comment: The expected performance level of a learner or professional as defined by a competency.
term status: stable
change history: https://credreg.net/ctdlasn/termhistory/ceasn/complexityLevel/json
domain includes: Competency
range includes: Concept
equivalent property: complexityLevel

Comprised Of
type: Property
comment: This competency includes, comprehends or encompasses, in whole or in part, the meaning, nature or importance of the referenced competency.
term status: stable
change history: https://credreg.net/ctdlasn/termhistory/ceasn/comprisedOf/json
domain includes: Competency
range includes: Competency
equivalent property: comprisedOf

Concept Keyword
type: Property
comment: A word or phrase used by the promulgating agency to refine and differentiate individual resources contextually.
usage note: This property should be used judiciously and in moderation. This property should be used only if an appropriate term does not exist in a controlled vocabulary.
term status: stable
change history: https://credreg.net/ctdlasn/termhistory/ceasn/conceptKeyword/json
sub property of: subject
domain includes: Progression Model
domain includes: Competency
domain includes: Competency Framework
domain includes: Rubric
domain includes: Concept Scheme
range includes: langString
equivalent property: conceptKeyword
equivalent property: keyword

Concept Term
type: Property
comment: A term drawn from a controlled vocabulary used by the promulgating agency to refine and differentiate individual resources contextually.
usage note: Note: Topic terms can include relevant people, places, things, and events.
term status: stable
change history: https://credreg.net/ctdlasn/termhistory/ceasn/conceptTerm/json
sub property of: subject
domain includes: Progression Model
domain includes: Competency
domain includes: Competency Framework
domain includes: Concept Scheme
range includes: Concept
equivalent property: conceptTerm
equivalent property: subject

Creator
type: Property
comment: An entity primarily responsible for making this resource.
description: The creator property is used with non-canonical statements created by a third party.
term status: stable
change history: https://credreg.net/ctdlasn/termhistory/ceasn/creator/json
sub property of: contributor
domain includes: Progression Model
domain includes: Competency
domain includes: Competency Framework
domain includes: Rubric
domain includes: AlignmentMap
domain includes: QualificationsFramework
domain includes: TransferAgreement
domain includes: Concept Scheme
range includes: CredentialOrganization
range includes: Organization
range includes: QACredentialOrganization
equivalent property: creator

Cross-Subject Reference
type: Property
comment: A relationship between this competency and a competency in a separate competency framework.
description: An interdisciplinary statement reference.
term status: stable
change history: https://credreg.net/ctdlasn/termhistory/ceasn/crossSubjectReference/json
sub property of: relation
domain includes: Competency
range includes: Competency
equivalent property: crossSubjectReference

Date Copyrighted
type: Property
comment: Date of a statement of copyright for this resource, such as ©2017.
term status: stable
change history: https://credreg.net/ctdlasn/termhistory/ceasn/dateCopyrighted/json
sub property of: date
domain includes: Progression Model
domain includes: Competency Framework
domain includes: Rubric
domain includes: AlignmentMap
domain includes: PriorLearningPolicy
domain includes: QualificationsFramework
domain includes: TransferAgreement
domain includes: Concept Scheme
range includes: string
equivalent property: dateCopyrighted

Date Created
type: Property
comment: Date of creation of this resource.
description: The dateCreated property is used for non-canonical statements created by a third party.
usage note: Values should be a full date, i.e. year, month and day; if the day or month are not known use ceasn:approximateDateCreated instead.
term status: stable
change history: https://credreg.net/ctdlasn/termhistory/ceasn/dateCreated/json
sub property of: date
domain includes: Progression Model
domain includes: Competency
domain includes: Competency Framework
domain includes: Rubric
domain includes: AlignmentMap
domain includes: PriorLearningPolicy
domain includes: QualificationsFramework
domain includes: TransferAgreement
domain includes: Concept Scheme
range includes: date
equivalent property: created

Date Modified
type: Property
comment: The date on which this resource was most recently modified in some way.
usage note: Values should be a full date, i.e. year, month and day; if the day or month are not known use ceasn:approximateDateModified instead.
term status: stable
change history: https://credreg.net/ctdlasn/termhistory/ceasn/dateModified/json
sub property of: date
domain includes: Progression Model
domain includes: Competency
domain includes: Competency Framework
domain includes: Rubric
domain includes: AlignmentMap
domain includes: Occupation
domain includes: PriorLearningPolicy
domain includes: QualificationsFramework
domain includes: Task
domain includes: TransferAgreement
domain includes: Concept Scheme
range includes: dateTime
equivalent property: modified
equivalent property: dateModified

Date Valid From
type: Property
comment: Beginning date of validity of this resource.
usage note: Where the resource is valid for a given period of time, use both the dateValidFrom and dateValidUntil properties.
term status: stable
change history: https://credreg.net/ctdlasn/termhistory/ceasn/dateValidFrom/json
sub property of: valid
domain includes: Competency Framework
domain includes: Rubric
domain includes: AlignmentMap
domain includes: QualificationsFramework
range includes: dateTime
equivalent property: startDate

Date Valid Until
type: Property
comment: End date of validity of this resource.
usage note: Where the resource is valid for a given period of time, use both the dateValidFrom and dateValidUntil properties.
term status: stable
change history: https://credreg.net/ctdlasn/termhistory/ceasn/dateValidUntil/json
sub property of: valid
domain includes: Competency Framework
domain includes: Rubric
domain includes: AlignmentMap
domain includes: QualificationsFramework
range includes: dateTime
equivalent property: endDate

Derived From
type: Property
comment: The entity being described has been modified, extended or refined from the referenced resource.
term status: stable
change history: https://credreg.net/ctdlasn/termhistory/ceasn/derivedFrom/json
sub property of: relation
domain includes: Competency
domain includes: Competency Framework
domain includes: Rubric
domain includes: AlignmentMap
domain includes: FinancialAssistanceProfile
domain includes: PriorLearningPolicy
domain includes: QualificationsFramework
domain includes: TransferAgreement
domain includes: TransferValueProfile
domain includes: Metric
range includes: Competency
range includes: Competency Framework
range includes: Rubric
range includes: AlignmentMap
range includes: FinancialAssistanceProfile
range includes: PriorLearningPolicy
range includes: QualificationsFramework
range includes: TransferAgreement
range includes: TransferValueProfile
range includes: Metric
equivalent property: derivedFrom

Description
type: Property
comment: A short description of this resource.
term status: stable
change history: https://credreg.net/ctdlasn/termhistory/ceasn/description/json
domain includes: Progression Model
domain includes: Competency Framework
domain includes: Rubric
domain includes: Rubric Criterion
domain includes: Rubric Level
domain includes: Concept Scheme
range includes: langString
equivalent property: description

Education Level Type
type: Property
comment: A general statement describing the education or training context. Alternatively, a more specific statement of the location of the audience in terms of its progression through an education or training context.
description: Best practice is to use terms from the http://purl.org/ctdl/terms/AudienceLevel concept scheme.
term status: stable
change history: https://credreg.net/ctdlasn/termhistory/ceasn/educationLevelType/json
sub property of: audience
domain includes: Competency
domain includes: Competency Framework
domain includes: Rubric
range includes: Concept
target scheme: AudienceLevel
equivalent property: educationLevel
equivalent property: audienceLevelType

Evaluator Type
type: Property
comment: Type of evaluator; select from an existing enumeration of such types.
term status: unstable
change history: https://credreg.net/ctdlasn/termhistory/ceasn/evaluatorType/json
domain includes: Rubric
range includes: Concept
target scheme: Evaluator Category

Exact Alignment
type: Property
comment: The relevant concepts in this competency and the referenced competency are coextensive.
term status: stable
change history: https://credreg.net/ctdlasn/termhistory/ceasn/exactAlignment/json
domain includes: Competency
range includes: Competency
equivalent property: exactAlignment

Feedback
type: Property
comment: Predefined feedback text for the benefit of the subject being evaluated.
description: This may include guidance and suggestions for improvement or development.
term status: stable
change history: https://credreg.net/ctdlasn/termhistory/ceasn/feedback/json
domain includes: Criterion Level
range includes: langString

Has Child
type: Property
comment: The referenced resource is lower in some arbitrary hierarchy than this resource.
description: This property identifies a child node in the downward path in the chain of resources in a taxon path.
term status: stable
change history: https://credreg.net/ctdlasn/termhistory/ceasn/hasChild/json
sub property of: relation
domain includes: Competency
domain includes: AssessmentComponent
domain includes: BasicComponent
domain includes: CocurricularComponent
domain includes: CollectionComponent
domain includes: CompetencyComponent
domain includes: CourseComponent
domain includes: CredentialComponent
domain includes: ExtracurricularComponent
domain includes: JobComponent
domain includes: MultiComponent
domain includes: Task
domain includes: WorkExperienceComponent
range includes: Competency
range includes: AssessmentComponent
range includes: BasicComponent
range includes: CocurricularComponent
range includes: CollectionComponent
range includes: CompetencyComponent
range includes: CourseComponent
range includes: CredentialComponent
range includes: ExtracurricularComponent
range includes: JobComponent
range includes: MultiComponent
range includes: Task
range includes: WorkExperienceComponent
equivalent property: hasChild
inverse of: Is Child Of

Has Criterion Category
type: Property
comment: Indicates a Concept for clustering logical sets of Rubric Criteria.
term status: unstable
change history: https://credreg.net/ctdlasn/termhistory/ceasn/hasCriterionCategory/json
domain includes: Rubric Criterion
range includes: Concept

Has Criterion Category Set
type: Property
comment: Indicates the Concept Scheme for clustering logical sets of Rubric Criteria.
term status: unstable
change history: https://credreg.net/ctdlasn/termhistory/ceasn/hasCriterionCategorySet/json
domain includes: Rubric
range includes: Concept Scheme

Has Criterion Level
type: Property
comment: Criterion Level for this resource.
term status: unstable
change history: https://credreg.net/ctdlasn/termhistory/ceasn/hasCriterionLevel/json
domain includes: Competency
domain includes: Criterion Level
domain includes: Rubric Criterion
domain includes: Rubric Level
range includes: Criterion Level

Has Rubric Criterion
type: Property
comment: Explicit criterion for ensuring specific and measurable evaluation.
term status: unstable
change history: https://credreg.net/ctdlasn/termhistory/ceasn/hasRubricCriterion/json
sub property of: hasCriterion
domain includes: Competency
domain includes: Rubric
range includes: Rubric Criterion

Has Rubric Level
type: Property
comment: Resource describing a level or quality indicator used with Rubric Criteria.
term status: unstable
change history: https://credreg.net/ctdlasn/termhistory/ceasn/hasRubricLevel/json
domain includes: Rubric
range includes: Rubric Level

Has Scope
type: Property
comment: Description of what the rubric's creator intended to assess or evaluate.
term status: unstable
change history: https://credreg.net/ctdlasn/termhistory/ceasn/hasScope/json
domain includes: Rubric
range includes: langString
equivalent property: hasScope

Has Top Child
type: Property
comment: Top-level child competency of a competency framework.
term status: stable
change history: https://credreg.net/ctdlasn/termhistory/ceasn/hasTopChild/json
domain includes: Competency Framework
range includes: Competency

Identifier
type: Property
comment: An alternative URI by which this competency framework or competency is identified.
term status: stable
change history: https://credreg.net/ctdlasn/termhistory/ceasn/identifier/json
domain includes: Competency
domain includes: Competency Framework
range includes: anyURI
equivalent property: identifier

Inferred Competency
type: Property
comment: Competency deduced or arrive at by reasoning on the competency being described.
term status: unstable
change history: https://credreg.net/ctdlasn/termhistory/ceasn/inferredCompetency/json
domain includes: Competency
range includes: Competency

In Language
type: Property
comment: The primary language used in or by this resource.
usage note: This is the language the text is primarily written in, even if it makes use of other languages. For example, a competency for teaching spanish to english-speaking students would primarily be in english, because that is the language used to convey the material.
term status: stable
change history: https://credreg.net/ctdlasn/termhistory/ceasn/inLanguage/json
domain includes: Progression Model
domain includes: Competency
domain includes: Competency Framework
domain includes: Rubric
domain includes: Concept Scheme
range includes: language
equivalent property: language

In Progression Model
type: Property
comment: Progression Model to which this Progression Level belongs.
term status: unstable
change history: https://credreg.net/ctdlasn/termhistory/ceasn/inProgressionModel/json
sub property of: In Scheme
domain includes: Progression Level
range includes: Progression Model

Is Child Of
type: Property
comment: The referenced resource is higher in some arbitrary hierarchy than this resource.
term status: stable
change history: https://credreg.net/ctdlasn/termhistory/ceasn/isChildOf/json
sub property of: relation
domain includes: Competency
domain includes: AssessmentComponent
domain includes: BasicComponent
domain includes: CocurricularComponent
domain includes: CollectionComponent
domain includes: CompetencyComponent
domain includes: CourseComponent
domain includes: CredentialComponent
domain includes: ExtracurricularComponent
domain includes: JobComponent
domain includes: MultiComponent
domain includes: Task
domain includes: WorkExperienceComponent
range includes: Competency
range includes: AssessmentComponent
range includes: BasicComponent
range includes: CocurricularComponent
range includes: CollectionComponent
range includes: CompetencyComponent
range includes: CourseComponent
range includes: CredentialComponent
range includes: ExtracurricularComponent
range includes: JobComponent
range includes: MultiComponent
range includes: Pathway
range includes: Task
range includes: WorkExperienceComponent
equivalent property: isChildOf
inverse of: Has Child

Is Part Of
type: Property
comment: Competency framework that this competency is a part of.
usage note: This property does not indicate whether or not this statement is a top-level statement in the referenced competency framework; only that it is in some way a part of that framework. To indicate that this statement is a top-level statement, use both this property and the isChildOf property.
term status: stable
change history: https://credreg.net/ctdlasn/termhistory/ceasn/isPartOf/json
sub property of: relation
domain includes: Competency
range includes: Competency Framework
equivalent property: isPartOf

Is Top Child Of
type: Property
comment: Indicates that this competency is at the top of some arbitrary hierarchy.
term status: stable
change history: https://credreg.net/ctdlasn/termhistory/ceasn/isTopChildOf/json
sub property of: Is Child Of
domain includes: Competency
range includes: Competency Framework

Is Version Of
type: Property
comment: A related competency of which this competency is a version, edition, or adaptation.
description: Changes in version imply substantive changes in content rather than differences in format.
term status: stable
change history: https://credreg.net/ctdlasn/termhistory/ceasn/isVersionOf/json
domain includes: Competency
range includes: Competency
equivalent property: isVersionOf

Knowledge Embodied
type: Property
comment: Body of information embodied either directly or indirectly in this resource.
term status: stable
change history: https://credreg.net/ctdlasn/termhistory/ceasn/knowledgeEmbodied/json
domain includes: Competency
domain includes: Job
domain includes: Occupation
domain includes: Task
domain includes: WorkRole
range includes: Competency

License
type: Property
comment: A legal document giving official permission to do something with this resource.
description: Value must be the URI to a license document (e.g., Creative Commons license or bespoke license).
term status: stable
change history: https://credreg.net/ctdlasn/termhistory/ceasn/license/json
sub property of: rights
domain includes: Progression Model
domain includes: Competency
domain includes: Competency Framework
domain includes: Rubric
domain includes: AlignmentMap
domain includes: Collection
domain includes: PriorLearningPolicy
domain includes: QualificationsFramework
domain includes: TransferAgreement
domain includes: DataSetDistribution
domain includes: DataSetProfile
domain includes: DataSetService
domain includes: Concept Scheme
range includes: anyURI
equivalent property: license

List ID
type: Property
comment: An alphanumeric string indicating the relative position of a resource in an ordered list of resources.
description: Examples of such strings include: such as "A", "B", or "a", "b", or "I", "II", or "1", "2".
usage note: Punctuation accompanying alphanumeric strings should not be included.
term status: stable
change history: https://credreg.net/ctdlasn/termhistory/ceasn/listID/json
sub property of: listID
domain includes: Competency
domain includes: Criterion Level
domain includes: Rubric Criterion
domain includes: Rubric Level
domain includes: StructuredStatement
domain includes: Task
range includes: string
equivalent property: listEnumeration

Local Subject
type: Property
comment: The text string denoting the subject of the competency framework or competency as designated by the promulgating agency.
usage note: The localSubject property and subject property may or may not point to the same subject. If so, enter the text string for the subject as the value of this property and the URI for that subject in the subject property.
term status: stable
change history: https://credreg.net/ctdlasn/termhistory/ceasn/localSubject/json
sub property of: subject
domain includes: Competency
domain includes: Competency Framework
range includes: langString
equivalent property: localSubject

Major Alignment
type: Property
comment: Major overlap of relevant concepts between this competency and the referenced competency.
term status: stable
change history: https://credreg.net/ctdlasn/termhistory/ceasn/majorAlignment/json
domain includes: Competency
range includes: Competency
equivalent property: majorAlignment

Minor Alignment
type: Property
comment: Minor overlap of relevant concepts between this competency and the referenced competency.
term status: stable
change history: https://credreg.net/ctdlasn/termhistory/ceasn/minorAlignment/json
domain includes: Competency
range includes: Competency
equivalent property: minorAlignment

Name
type: Property
comment: The name or title of this resource.
term status: stable
change history: https://credreg.net/ctdlasn/termhistory/ceasn/name/json
domain includes: Progression Model
domain includes: Competency Framework
domain includes: Rubric
domain includes: Rubric Criterion
domain includes: Rubric Level
domain includes: Concept Scheme
range includes: langString
equivalent property: title
equivalent property: name

Narrow Alignment
type: Property
comment: This competency covers all of the relevant concepts in the referenced competency as well as relevant concepts not found in the referenced competency.
term status: stable
change history: https://credreg.net/ctdlasn/termhistory/ceasn/narrowAlignment/json
domain includes: Competency
range includes: Competency
equivalent property: narrowAlignment

Prerequisite Alignment
type: Property
comment: The referenced resource is a prerequisite to this resource.
term status: stable
change history: https://credreg.net/ctdlasn/termhistory/ceasn/prerequisiteAlignment/json
domain includes: Competency
range includes: Competency
equivalent property: prerequisiteAlignment

Publication Status Type
type: Property
comment: The publication status of the resource.
usage note: With competencies that originate as part of a competency framework that includes an applicable publication status, it is not necessary to include that status on every competency in the framework.
term status: stable
change history: https://credreg.net/ctdlasn/termhistory/ceasn/publicationStatusType/json
domain includes: Progression Model
domain includes: Competency
domain includes: Competency Framework
domain includes: Rubric
domain includes: AlignmentMap
domain includes: PriorLearningPolicy
domain includes: QualificationsFramework
domain includes: RegulatoryInformation
domain includes: TransferAgreement
domain includes: DataSetProfile
domain includes: Concept Scheme
range includes: Concept
target scheme: Publication Status Concept Scheme
equivalent property: publicationStatus

Publisher
type: Property
comment: An agent responsible for making this resource available.
description: Also referred to as the promulgating agency of the entity.
term status: stable
change history: https://credreg.net/ctdlasn/termhistory/ceasn/publisher/json
domain includes: Progression Model
domain includes: Competency Framework
domain includes: Rubric
domain includes: AlignmentMap
domain includes: QualificationsFramework
domain includes: Metric
domain includes: Concept Scheme
range includes: CredentialOrganization
range includes: Organization
range includes: QACredentialOrganization
equivalent property: publisher

Publisher Name
type: Property
comment: Name of an agent responsible for making this resource available.
description: Also referred to as the promulgating agency of the entity.
term status: stable
change history: https://credreg.net/ctdlasn/termhistory/ceasn/publisherName/json
domain includes: Progression Model
domain includes: Competency Framework
domain includes: Rubric
domain includes: AlignmentMap
domain includes: QualificationsFramework
domain includes: Concept Scheme
range includes: langString
equivalent property: publisher

Repository Date
type: Property
comment: The date this competency framework was added to the repository.
term status: stable
change history: https://credreg.net/ctdlasn/termhistory/ceasn/repositoryDate/json
domain includes: Competency Framework
range includes: date
equivalent property: repositoryDate

Rights
type: Property
comment: Information about rights held in and over this resource.
term status: stable
change history: https://credreg.net/ctdlasn/termhistory/ceasn/rights/json
sub property of: rights
domain includes: Progression Model
domain includes: Competency Framework
domain includes: Rubric
domain includes: AlignmentMap
domain includes: PriorLearningPolicy
domain includes: QualificationsFramework
domain includes: TransferAgreement
domain includes: DataSetDistribution
domain includes: DataSetProfile
domain includes: DataSetService
domain includes: Concept Scheme
range includes: langString
equivalent property: rights

Rights Holder
type: Property
comment: An agent owning or managing rights over this resource.
term status: stable
change history: https://credreg.net/ctdlasn/termhistory/ceasn/rightsHolder/json
domain includes: Progression Model
domain includes: Competency Framework
domain includes: PriorLearningPolicy
domain includes: TransferAgreement
domain includes: Concept Scheme
range includes: CredentialOrganization
range includes: Organization
range includes: QACredentialOrganization
equivalent property: rightsHolder

Should Index
type: Property
comment: Indicates whether correlators should or should not assign the competency during correlation.
term status: unstable
change history: https://credreg.net/ctdlasn/termhistory/ceasn/shouldIndex/json
domain includes: Competency
range includes: boolean
equivalent property: indexingStatus

Skill Embodied
type: Property
comment: Ability to apply knowledge and use know-how to complete tasks and solve problems including types or categories of developed proficiency or dexterity in mental operations and physical processes is embodied either directly or indirectly in this resource.
usage note: The skillEmbodied property may reference a defined skill in an ontology such as O*NET or an existing competency defined in a competency framework.
term status: stable
change history: https://credreg.net/ctdlasn/termhistory/ceasn/skillEmbodied/json
domain includes: Competency
domain includes: Job
domain includes: Occupation
domain includes: Task
domain includes: WorkRole
range includes: Competency
equivalent property: skillEmbodied

Source
type: Property
comment: The original competency framework which this resource is based on or derived from.
term status: stable
change history: https://credreg.net/ctdlasn/termhistory/ceasn/source/json
sub property of: relation
domain includes: Progression Model
domain includes: Competency Framework
domain includes: Concept Scheme
range includes: anyURI
equivalent property: source

Source Documentation
type: Property
comment: Human-readable information resource other than a competency framework from which this resource was generated or identified by humans or machines.
description: The intended use case for this is when documentation is analyzed in order to find and describe entities such as competencies and concepts.
term status: unstable
change history: https://credreg.net/ctdlasn/termhistory/ceasn/sourceDocumentation/json
domain includes: Competency
domain includes: Competency Framework
domain includes: AlignmentMap
domain includes: QualificationsFramework
domain includes: Concept
domain includes: Concept Scheme
range includes: anyURI

Substantiating Competency Framework
type: Property
comment: Aspects of the referenced Competency Framework provide some justification that the resource being described is useful.
term status: unstable
change history: https://credreg.net/ctdlasn/termhistory/ceasn/substantiatingCompetencyFramework/json
sub property of: Substantiating Resource
domain includes: Competency
range includes: Competency Framework

Substantiating Credential
type: Property
comment: Aspects of the referenced Credential provide some justification that the resource being described is useful.
term status: unstable
change history: https://credreg.net/ctdlasn/termhistory/ceasn/substantiatingCredential/json
sub property of: Substantiating Resource
domain includes: Competency
range includes: AcademicCertificate
range includes: ApprenticeshipCertificate
range includes: AssociateDegree
range includes: AssociateOfAppliedArtsDegree
range includes: AssociateOfAppliedScienceDegree
range includes: AssociateOfArtsDegree
range includes: AssociateOfScienceDegree
range includes: BachelorDegree
range includes: BachelorOfArtsDegree
range includes: BachelorOfScienceDegree
range includes: Badge
range includes: BasicTechnicalCertificate
range includes: Certificate
range includes: CertificateOfCompletion
range includes: CertificateOfParticipation
range includes: Certification
range includes: Credential
range includes: Degree
range includes: DigitalBadge
range includes: Diploma
range includes: DoctoralDegree
range includes: GeneralEducationDevelopment
range includes: GeneralEducationLevel1Certificate
range includes: GeneralEducationLevel2Certificate
range includes: HigherEducationLevel1Certificate
range includes: HigherEducationLevel2Certificate
range includes: JourneymanCertificate
range includes: License
range includes: MasterCertificate
range includes: MasterDegree
range includes: MasterOfArtsDegree
range includes: MasterOfScienceDegree
range includes: MicroCredential
range includes: OpenBadge
range includes: PostBaccalaureateCertificate
range includes: PostMasterCertificate
range includes: PreApprenticeshipCertificate
range includes: ProfessionalCertificate
range includes: ProfessionalDoctorate
range includes: ProficiencyCertificate
range includes: QualityAssuranceCredential
range includes: ResearchDoctorate
range includes: SecondaryEducationCertificate
range includes: SecondarySchoolDiploma
range includes: TechnicalLevel1Certificate
range includes: TechnicalLevel2Certificate
range includes: TechnicalLevel3Certificate
range includes: WorkBasedLearningCertificate

Substantiating Job
type: Property
comment: Aspects of the referenced Job provide some justification that the resource being described is useful.
term status: unstable
change history: https://credreg.net/ctdlasn/termhistory/ceasn/substantiatingJob/json
sub property of: Substantiating Resource
domain includes: Competency
range includes: Job

Substantiating Occupation
type: Property
comment: Aspects of the referenced Occupation provide some justification that the resource being described is useful.
term status: unstable
change history: https://credreg.net/ctdlasn/termhistory/ceasn/substantiatingOccupation/json
sub property of: Substantiating Resource
domain includes: Competency
range includes: Occupation

Substantiating Organization
type: Property
comment: Aspects of the referenced Organization provide some justification that the resource being described is useful.
term status: unstable
change history: https://credreg.net/ctdlasn/termhistory/ceasn/substantiatingOrganization/json
sub property of: Substantiating Resource
domain includes: Competency
range includes: CredentialOrganization
range includes: Organization
range includes: QACredentialOrganization

Substantiating Resource
type: Property
comment: Aspects of the referenced resource provide some justification that the resource being described is useful.
term status: unstable
change history: https://credreg.net/ctdlasn/termhistory/ceasn/substantiatingResource/json
domain includes: Competency
range includes: anyURI

Substantiating Task
type: Property
comment: Aspects of the referenced Task provide some justification that the resource being described is useful.
term status: unstable
change history: https://credreg.net/ctdlasn/termhistory/ceasn/substantiatingTask/json
sub property of: Substantiating Resource
domain includes: Competency
range includes: Task

Substantiating Work Role
type: Property
comment: Aspects of the referenced Work Role provide some justification that the resource being described is useful.
term status: unstable
change history: https://credreg.net/ctdlasn/termhistory/ceasn/substantiatingWorkRole/json
sub property of: Substantiating Resource
domain includes: Competency
range includes: WorkRole

Table of Contents
type: Property
comment: A list of sub-units of this resource.
description: The table of contents is a "manifest", or a hierarchic, ordered, syntactic representation of the sections of this resource; for example, the competencies that are part of a competency framework.
term status: stable
change history: https://credreg.net/ctdlasn/termhistory/ceasn/tableOfContents/json
domain includes: Competency Framework
domain includes: PriorLearningPolicy
domain includes: TransferAgreement
range includes: langString
equivalent property: tableOfContents

Task Embodied
type: Property
comment: Specifically defined piece of work embodied either directly or indirectly in this resource.
term status: stable
change history: https://credreg.net/ctdlasn/termhistory/ceasn/taskEmbodied/json
domain includes: Competency
range includes: Competency
range includes: Task

Weight
type: Property
comment: An asserted measurement of the weight, degree, percent, or strength of a recommendation, requirement, or comparison.
description: Best practice is to assign a decimal value weight between 0 and 1 that indicates the strength of the assertion, with 0 being weakest and 1 being strongest.
term status: stable
change history: https://credreg.net/ctdlasn/termhistory/ceasn/weight/json
domain includes: Competency
domain includes: Rubric Criterion
range includes: float
equivalent property: weight

CTID
type: Property
comment: Globally unique Credential Transparency Identifier (CTID) by which the creator, owner or provider of a resource recognizes it in transactions with the external environment (e.g., in verifiable claims involving the resource).
description: The CTID is the equivalent of a version identifier for the resource. Different versions of a resource are considered distinct expressions and each must be assigned its own CTID. Each version of a resource can have only one CTID assigned. However, a single version of a resource may have distinct identifier values for both the ctid property and the credentialId property. In such a case both identifiers will be recognized by the resource creator/owner/provider in transactions with the external environment.
term status: stable
change history: https://credreg.net/ctdlasn/termhistory/ceterms/ctid/json
sub property of: credentialId
domain includes: Progression Level
domain includes: Progression Model
domain includes: Competency
domain includes: Competency Framework
domain includes: CrtiterionLevel
domain includes: Rubric
domain includes: Rubric Criterion
domain includes: AcademicCertificate
domain includes: AccreditAction
domain includes: AdvancedStandingAction
domain includes: AlignmentMap
domain includes: ApprenticeshipCertificate
domain includes: ApproveAction
domain includes: AssessmentComponent
domain includes: AssessmentProfile
domain includes: AssociateDegree
domain includes: AssociateOfAppliedArtsDegree
domain includes: AssociateOfAppliedScienceDegree
domain includes: AssociateOfArtsDegree
domain includes: AssociateOfScienceDegree
domain includes: BachelorDegree
domain includes: BachelorOfArtsDegree
domain includes: BachelorOfScienceDegree
domain includes: Badge
domain includes: BasicComponent
domain includes: BasicTechnicalCertificate
domain includes: Certificate
domain includes: CertificateOfCompletion
domain includes: CertificateOfParticipation
domain includes: Certification
domain includes: CocurricularComponent
domain includes: Collection
domain includes: CollectionComponent
domain includes: CompetencyComponent
domain includes: ConditionManifest
domain includes: CostManifest
domain includes: Course
domain includes: CourseComponent
domain includes: Credential
domain includes: CredentialComponent
domain includes: CredentialingAction
domain includes: CredentialOrganization
domain includes: CredentialType
domain includes: Degree
domain includes: DigitalBadge
domain includes: Diploma
domain includes: DoctoralDegree
domain includes: ExtracurricularComponent
domain includes: FinancialAssistanceProfile
domain includes: GeneralEducationDevelopment
domain includes: GeneralEducationLevel1Certificate
domain includes: GeneralEducationLevel2Certificate
domain includes: HigherEducationLevel1Certificate
domain includes: HigherEducationLevel2Certificate
domain includes: Industry
domain includes: Job
domain includes: JobComponent
domain includes: JourneymanCertificate
domain includes: LearningOpportunityProfile
domain includes: LearningProgram
domain includes: License
domain includes: MasterCertificate
domain includes: MasterDegree
domain includes: MasterOfArtsDegree
domain includes: MasterOfScienceDegree
domain includes: MicroCredential
domain includes: MultiComponent
domain includes: Occupation
domain includes: OfferAction
domain includes: OpenBadge
domain includes: Organization
domain includes: Pathway
domain includes: PathwaySet

Industry Type
type: Property
comment: Type of industry; select from an existing enumeration of such types such as the SIC, NAICS, and ISIC classifications.
usage note: Best practice in identifying industries for U.S. resources is to provide the NAICS code using the ceterms:naics property. Other resources may use the ceterms:industrytype property and any framework of the class ceterms:IndustryClassification.
term status: stable
change history: https://credreg.net/ctdlasn/termhistory/ceterms/industryType/json
sub property of: credentialAlignment
domain includes: Competency
domain includes: Competency Framework
domain includes: Rubric
domain includes: AcademicCertificate
domain includes: ApprenticeshipCertificate
domain includes: AssessmentProfile
domain includes: AssociateDegree
domain includes: AssociateOfAppliedArtsDegree
domain includes: AssociateOfAppliedScienceDegree
domain includes: AssociateOfArtsDegree
domain includes: AssociateOfScienceDegree
domain includes: BachelorDegree
domain includes: BachelorOfArtsDegree
domain includes: BachelorOfScienceDegree
domain includes: Badge
domain includes: BasicTechnicalCertificate
domain includes: Certificate
domain includes: CertificateOfCompletion
domain includes: CertificateOfParticipation
domain includes: Certification
domain includes: Collection
domain includes: Course
domain includes: Credential
domain includes: CredentialOrganization
domain includes: CredentialType
domain includes: Degree
domain includes: DigitalBadge
domain includes: Diploma
domain includes: DoctoralDegree
domain includes: GeneralEducationDevelopment
domain includes: GeneralEducationLevel1Certificate
domain includes: GeneralEducationLevel2Certificate
domain includes: HigherEducationLevel1Certificate
domain includes: HigherEducationLevel2Certificate
domain includes: Industry
domain includes: Job
domain includes: JobComponent
domain includes: JourneymanCertificate
domain includes: LearningOpportunityProfile
domain includes: LearningProgram
domain includes: License
domain includes: MasterCertificate
domain includes: MasterDegree
domain includes: MasterOfArtsDegree
domain includes: MasterOfScienceDegree
domain includes: MicroCredential
domain includes: Occupation
domain includes: OpenBadge
domain includes: Organization
domain includes: Pathway
domain includes: PostBaccalaureateCertificate
domain includes: PostMasterCertificate
domain includes: PreApprenticeshipCertificate
domain includes: ProfessionalCertificate
domain includes: ProfessionalDoctorate
domain includes: ProficiencyCertificate
domain includes: QACredentialOrganization
domain includes: QualityAssuranceCredential
domain includes: ResearchDoctorate
domain includes: SecondaryEducationCertificate
domain includes: SecondarySchoolDiploma
domain includes: SpecialistDegree
domain includes: TechnicalLevel1Certificate
domain includes: TechnicalLevel2Certificate
domain includes: TechnicalLevel3Certificate
domain includes: WorkBasedLearningCertificate
range includes: CredentialAlignmentObject
target scheme: IndustryClassification

Instructional Program Type
type: Property
comment: Type of instructional program; select from an existing enumeration of such types.
usage note: For U.S. credentials, best practice is to use a framework such as the CIP (Classification of Instructional Programs). Other credentials may use any framework of the class CTDL InstructionalProgramClassification.
term status: stable
change history: https://credreg.net/ctdlasn/termhistory/ceterms/instructionalProgramType/json
sub property of: credentialAlignment
domain includes: Competency
domain includes: Competency Framework
domain includes: Rubric
domain includes: AcademicCertificate
domain includes: ApprenticeshipCertificate
domain includes: AssessmentProfile
domain includes: AssociateDegree
domain includes: AssociateOfAppliedArtsDegree
domain includes: AssociateOfAppliedScienceDegree
domain includes: AssociateOfArtsDegree
domain includes: AssociateOfScienceDegree
domain includes: BachelorDegree
domain includes: BachelorOfArtsDegree
domain includes: BachelorOfScienceDegree
domain includes: Badge
domain includes: BasicTechnicalCertificate
domain includes: Certificate
domain includes: CertificateOfCompletion
domain includes: CertificateOfParticipation
domain includes: Certification
domain includes: Collection
domain includes: Course
domain includes: Credential
domain includes: Degree
domain includes: DigitalBadge
domain includes: Diploma
domain includes: DoctoralDegree
domain includes: GeneralEducationDevelopment
domain includes: GeneralEducationLevel1Certificate
domain includes: GeneralEducationLevel2Certificate
domain includes: HigherEducationLevel1Certificate
domain includes: HigherEducationLevel2Certificate
domain includes: JourneymanCertificate
domain includes: LearningOpportunityProfile
domain includes: LearningProgram
domain includes: License
domain includes: MasterCertificate
domain includes: MasterDegree
domain includes: MasterOfArtsDegree
domain includes: MasterOfScienceDegree
domain includes: MicroCredential
domain includes: OpenBadge
domain includes: Pathway
domain includes: PostBaccalaureateCertificate
domain includes: PostMasterCertificate
domain includes: PreApprenticeshipCertificate
domain includes: ProfessionalCertificate
domain includes: ProfessionalDoctorate
domain includes: ProficiencyCertificate
domain includes: QualityAssuranceCredential
domain includes: ResearchDoctorate
domain includes: SecondaryEducationCertificate
domain includes: SecondarySchoolDiploma
domain includes: SpecialistDegree
domain includes: TechnicalLevel1Certificate
domain includes: TechnicalLevel2Certificate
domain includes: TechnicalLevel3Certificate
domain includes: WorkBasedLearningCertificate
domain includes: DataSetProfile
range includes: CredentialAlignmentObject
range includes: Concept
target scheme: InstructionalProgramClassification

Occupation Type
type: Property
comment: Type of occupation; select from an existing enumeration of such types.
usage note: For U.S. resources, best practice is to identify an occupation using a framework such as the ONet. Other resources may use any framework of the class ceterms:OccupationClassification, such as the EU's ESCO, ISCO-08, and SOC 2010.
term status: stable
change history: https://credreg.net/ctdlasn/termhistory/ceterms/occupationType/json
sub property of: credentialAlignment
domain includes: Competency
domain includes: Competency Framework
domain includes: Rubric
domain includes: AcademicCertificate
domain includes: ApprenticeshipCertificate
domain includes: AssessmentProfile
domain includes: AssociateDegree
domain includes: AssociateOfAppliedArtsDegree
domain includes: AssociateOfAppliedScienceDegree
domain includes: AssociateOfArtsDegree
domain includes: AssociateOfScienceDegree
domain includes: BachelorDegree
domain includes: BachelorOfArtsDegree
domain includes: BachelorOfScienceDegree
domain includes: Badge
domain includes: BasicTechnicalCertificate
domain includes: Certificate
domain includes: CertificateOfCompletion
domain includes: CertificateOfParticipation
domain includes: Certification
domain includes: Collection
domain includes: Course
domain includes: Credential
domain includes: Degree
domain includes: DigitalBadge
domain includes: Diploma
domain includes: DoctoralDegree
domain includes: GeneralEducationDevelopment
domain includes: GeneralEducationLevel1Certificate
domain includes: GeneralEducationLevel2Certificate
domain includes: HigherEducationLevel1Certificate
domain includes: HigherEducationLevel2Certificate
domain includes: Job
domain includes: JobComponent
domain includes: JourneymanCertificate
domain includes: LearningOpportunityProfile
domain includes: LearningProgram
domain includes: License
domain includes: MasterCertificate
domain includes: MasterDegree
domain includes: MasterOfArtsDegree
domain includes: MasterOfScienceDegree
domain includes: MicroCredential
domain includes: Occupation
domain includes: OpenBadge
domain includes: Pathway
domain includes: PostBaccalaureateCertificate
domain includes: PostMasterCertificate
domain includes: PreApprenticeshipCertificate
domain includes: ProfessionalCertificate
domain includes: ProfessionalDoctorate
domain includes: ProficiencyCertificate
domain includes: QualityAssuranceCredential
domain includes: ResearchDoctorate
domain includes: SecondaryEducationCertificate
domain includes: SecondarySchoolDiploma
domain includes: SpecialistDegree
domain includes: SupportService
domain includes: TechnicalLevel1Certificate
domain includes: TechnicalLevel2Certificate
domain includes: TechnicalLevel3Certificate
domain includes: WorkBasedLearningCertificate
range includes: CredentialAlignmentObject
target scheme: OccupationClassification
equivalent property: occupationalCategory

Alternative Label
type: Property
comment: Non-preferred label for the concept used to relate a concept synonym to the preferred label.
term status: stable
change history: https://credreg.net/ctdlasn/termhistory/skos/altLabel/json
domain includes: Concept
range includes: langString

Broader
type: Property
comment: Concept that is broader in some way than this concept.
term status: stable
change history: https://credreg.net/ctdlasn/termhistory/skos/broader/json
domain includes: Progression Level
domain includes: Concept
range includes: Progression Level
range includes: Concept

Broad Match
type: Property
comment: Assertion indicates that the referenced concept is broader in some way than this concept.
term status: stable
change history: https://credreg.net/ctdlasn/termhistory/skos/broadMatch/json
domain includes: Concept
range includes: Concept

Change Note
type: Property
comment: Text describing a significant change to the concept.
term status: stable
change history: https://credreg.net/ctdlasn/termhistory/skos/changeNote/json
domain includes: Concept
range includes: langString

Close Match
type: Property
comment: Assertion indicates that two concepts are sufficiently similar that they can be used interchangeably.
term status: stable
change history: https://credreg.net/ctdlasn/termhistory/skos/closeMatch/json
domain includes: Concept
range includes: Concept

Definition
type: Property
comment: Supplies a complete explanation of the intended meaning of a concept.
term status: stable
change history: https://credreg.net/ctdlasn/termhistory/skos/definition/json
domain includes: Progression Level
domain includes: Concept
range includes: langString

Exact Match
type: Property
comment: Indicates semantic similarity denoting an even higher degree of closeness than skos:closeMatch.
term status: stable
change history: https://credreg.net/ctdlasn/termhistory/skos/exactMatch/json
domain includes: Concept
range includes: Concept

Has Top Concept
type: Property
comment: Concept of the scheme at the top of a hierarchy of narrower concepts.
term status: stable
change history: https://credreg.net/ctdlasn/termhistory/skos/hasTopConcept/json
domain includes: Progression Model
domain includes: Concept Scheme
range includes: Progression Level
range includes: Concept

Hidden Label
type: Property
comment: Label not intended for public presentation but to assist applications in disambiguating searcher intent - e.g., hidden labels can be used for common misspelling or a colloquial expression.
term status: stable
change history: https://credreg.net/ctdlasn/termhistory/skos/hiddenLabel/json
domain includes: Concept
range includes: langString

In Scheme
type: Property
comment: Concept scheme to which this concept belongs.
term status: stable
change history: https://credreg.net/ctdlasn/termhistory/skos/inScheme/json
domain includes: Concept
range includes: Concept Scheme

Narrower
type: Property
comment: Concept that is narrower in some way than this concept.
term status: stable
change history: https://credreg.net/ctdlasn/termhistory/skos/narrower/json
domain includes: Progression Level
domain includes: Concept
range includes: Progression Level
range includes: Concept

Narrow Match
type: Property
comment: Assertion indicates that the referenced concept is narrower in some way than this concept.
term status: stable
change history: https://credreg.net/ctdlasn/termhistory/skos/narrowMatch/json
domain includes: Concept
range includes: Concept

Notation
type: Property
comment: Alphanumeric notation or ID code as defined by the promulgating body to identify this resource.
term status: stable
change history: https://credreg.net/ctdlasn/termhistory/skos/notation/json
domain includes: Progression Level
domain includes: Concept
range includes: string

Note
type: Property
comment: Annotations to the concept for purposes of general documentation.
term status: stable
change history: https://credreg.net/ctdlasn/termhistory/skos/note/json
domain includes: Progression Level
domain includes: Concept
range includes: langString

Preferred Label
type: Property
comment: Preferred language-tagged label representing this concept.
term status: stable
change history: https://credreg.net/ctdlasn/termhistory/skos/prefLabel/json
domain includes: Progression Level
domain includes: Concept
range includes: langString

Related
type: Property
comment: Assertion indicating an associative, non-hierarchical relationship between the two concepts where neither is broader nor narrower than the other.
term status: stable
change history: https://credreg.net/ctdlasn/termhistory/skos/related/json
domain includes: Concept
range includes: Concept

Top Concept Of
type: Property
comment: Concept scheme for which this concept is a top node in a hierarchy of concepts.
term status: stable
change history: https://credreg.net/ctdlasn/termhistory/skos/topConceptOf/json
domain includes: Progression Level
domain includes: Concept
range includes: Progression Model
range includes: Concept Scheme

Evaluator Category
type: Concept Scheme
comment: Category of agents that perform evaluation.
term status: unstable
change history: https://credreg.net/ctdlasn/termhistory/ceasn/EvaluatorCategory/json
has concept: Authority
has concept: Automated
has concept: External
has concept: Peer
has concept: Self
Has Top Concept: Authority
Has Top Concept: Automated
Has Top Concept: External
Has Top Concept: Peer
Has Top Concept: Self

Publication Status Concept Scheme
type: Concept Scheme
comment: Describes the various publication statuses of competency frameworks and statements.
term status: stable
change history: https://credreg.net/ctdlasn/termhistory/ceasn/PublicationStatus/json
equivalent class: ASNPublicationStatus
has concept: Deprecated
has concept: Draft
has concept: Published
Has Top Concept: Deprecated
Has Top Concept: Draft
Has Top Concept: Published

Authority
type: Concept
definition: Evaluator is an agent with authority over the person, group, or thing being evaluated in the relevant context.
description: Examples include teachers, supervisors, managers, or others with positions over the person or group being evaluated.
term status: unstable
change history: https://credreg.net/ctdlasn/termhistory/evalCat/Authority/json
In Scheme: Evaluator Category
Top Concept Of: Evaluator Category

Automated
type: Concept
definition: Evaluator is an automated agent or process.
term status: unstable
change history: https://credreg.net/ctdlasn/termhistory/evalCat/Automated/json
In Scheme: Evaluator Category
Top Concept Of: Evaluator Category

External
type: Concept
definition: Evaluator is an agent who is outside the context of the person, group, or thing being evaluated.
description: Evaluator is typically independent of the person, group, or thing being evaluated.
term status: unstable
change history: https://credreg.net/ctdlasn/termhistory/evalCat/External/json
In Scheme: Evaluator Category
Top Concept Of: Evaluator Category

Peer
type: Concept
definition: Evaluator is one or more peers of the person, group, or thing being evaluated.
description: Peers may be people taking the same course or in similar job roles.
term status: unstable
change history: https://credreg.net/ctdlasn/termhistory/evalCat/Peer/json
In Scheme: Evaluator Category
Top Concept Of: Evaluator Category

Self
type: Concept
definition: Evaluator is the person or group being evaluated.
term status: unstable
change history: https://credreg.net/ctdlasn/termhistory/evalCat/Self/json
In Scheme: Evaluator Category
Top Concept Of: Evaluator Category

Deprecated
type: Concept
definition: Status assigned to a document/statement by the promulgating agency asserting that the document/statement has been superseded or its use otherwise disfavored.
term status: stable
change history: https://credreg.net/ctdlasn/termhistory/publicationStatus/Deprecated/json
equivalent class: Deprecated
In Scheme: Publication Status Concept Scheme
Top Concept Of: Publication Status Concept Scheme

Draft
type: Concept
definition: A status assigned to all documents/statements during development.
usage note: Draft documents and statements should not be displayed to anyone other than their owners and relevant administrators.
term status: stable
change history: https://credreg.net/ctdlasn/termhistory/publicationStatus/Draft/json
equivalent class: Draft
In Scheme: Publication Status Concept Scheme
Top Concept Of: Publication Status Concept Scheme

Published
type: Concept
definition: Status assigned to all documents that have been published.
term status: stable
change history: https://credreg.net/ctdlasn/termhistory/publicationStatus/Published/json
equivalent class: Published
In Scheme: Publication Status Concept Scheme
Top Concept Of: Publication Status Concept Scheme