Progression Level
type: Class
comment: Identifiable point along a developmental progression of competence, achievement or temporal position.
term status: stable
change history: https://credreg.net/ctdlasn/termhistory/asn/ProgressionLevel/json
subclass of: Concept
domain for: inProgressionModel
domain for: ctid
domain for: broader
domain for: definition
domain for: narrower
domain for: notation
domain for: note
domain for: prefLabel
domain for: topConceptOf