Ability Embodied
type: Property
comment: Enduring attributes of the individual that influence performance are embodied either directly or indirectly in this competency.
usage note: The abilityEmbodied property may referenced a defined ability in an ontology such as O*NET or an existing competency defined in a competency framework.
term status: stable
change history: https://credreg.net/ctdlasn/termhistory/ceasn/abilityEmbodied/json
domain includes: Competency
range includes: anyURI