Broader
type: Property
comment: Concept that is broader in some way than this concept.
term status: stable
change history: https://credreg.net/ctdlasn/termhistory/skos/broader/json
domain includes: ProgressionLevel
domain includes: Concept
range includes: ProgressionLevel
range includes: Concept