Change Note
type: Property
comment: Text describing a significant change to the concept.
term status: stable
change history: https://credreg.net/ctdlasn/termhistory/skos/changeNote/json
domain includes: Concept
range includes: langString