Competency Label
type: Property
comment: Short identifying phrase or name applied to a competency by the creator of the competency framework.
usage note: Where such a label is the sole expression of the competency, enter the text as competencyText as opposed to competencyLabel.
term status: stable
change history: https://credreg.net/ctdlasn/termhistory/ceasn/competencyLabel/json
sub property of: name
domain includes: Competency
range includes: langString