Has Progression Level
type: Property
comment: Reference to a specific point in a progression model.
term status: stable
change history: https://credreg.net/ctdlasn/termhistory/asn/hasProgressionLevel/json
domain includes: Competency
domain includes: CriterionLevel
domain includes: Rubric
domain includes: RubricCriterion
domain includes: RubricLevel
domain includes: AssessmentComponent
domain includes: BasicComponent
domain includes: CocurricularComponent
domain includes: CollectionComponent
domain includes: CompetencyComponent
domain includes: CourseComponent
domain includes: CredentialComponent
domain includes: ExtracurricularComponent
domain includes: JobComponent
domain includes: MultiComponent
domain includes: WorkExperienceComponent
range includes: ProgressionLevel