Has Rubric Criterion
type: Property
comment: Explicit criterion for ensuring specific and measurable evaluation.
term status: unstable
change history: https://credreg.net/ctdlasn/termhistory/ceasn/hasRubricCriterion/json
sub property of: hasCriterion
domain includes: Competency
domain includes: Rubric
range includes: RubricCriterion