Has Top Child
type: Property
comment: Top-level child competency of a competency framework.
term status: stable
change history: https://credreg.net/ctdlasn/termhistory/ceasn/hasTopChild/json
domain includes: CompetencyFramework
range includes: Competency