In Language
type: Property
comment: The primary language used in or by this resource.
usage note: This is the language the text is primarily written in, even if it makes use of other languages. For example, a competency for teaching spanish to english-speaking students would primarily be in english, because that is the language used to convey the material.
term status: stable
change history: https://credreg.net/ctdlasn/termhistory/ceasn/inLanguage/json
domain includes: Competency
domain includes: CompetencyFramework
domain includes: Concept
domain includes: ConceptScheme
range includes: language
equivalent property: language