In Progression Model
type: Property
comment: Progression Model to which this Progression Level belongs.
term status: unstable
change history: https://credreg.net/ctdlasn/termhistory/ceasn/inProgressionModel/json
sub property of: inScheme
domain includes: ProgressionLevel
range includes: ProgressionModel