List ID
type: Property
comment: An alphanumeric string indicating the relative position of a resource in an ordered list of resources.
description: Examples of such strings include: such as "A", "B", or "a", "b", or "I", "II", or "1", "2".
usage note: Punctuation accompanying alphanumeric strings should not be included.
term status: stable
change history: https://credreg.net/ctdlasn/termhistory/ceasn/listID/json
sub property of: listID
domain includes: Competency
domain includes: CriterionLevel
domain includes: RubricCriterion
domain includes: RubricLevel
domain includes: StructuredStatement
domain includes: Task
range includes: string
equivalent property: listEnumeration