Major Alignment
type: Property
comment: Major overlap of relevant concepts between this competency and the referenced competency.
term status: stable
change history: https://credreg.net/ctdlasn/termhistory/ceasn/majorAlignment/json
domain includes: Competency
range includes: Competency
equivalent property: majorAlignment