Related
type: Property
comment: Assertion indicating an associative, non-hierarchical relationship between the two concepts where neither is broader nor narrower than the other.
term status: stable
change history: https://credreg.net/ctdlasn/termhistory/skos/related/json
domain includes: Concept
range includes: Concept